{"text_format":"1","workbook":"xlsx","n_sheets":7,"sheets":["Title Page","Solar Resource","Lights","Battery Bank","Array Sizing"," Design Spec","Conclusion"],"not_rendered":{"charts":0,"images":12,"macros":1,"external_links":0,"defined_names":2,"comments":5,"pivot_tables":0},"unopened":[],"bounds":{"document_bytes":16777216,"sheet_cells":100000,"rows_first":2000,"rows_last":500,"rows_between":2000,"halvings":0,"cell_chars":16384,"cell_head_chars":4096},"cells_cut":0,"cells_raw":0,"read":"whole","date_system":"1900"}

{"sheet":"Title Page","index":0,"n_rows":50,"n_cols":12,"rows_kept":50,"cut":false,"hidden":false,"merged":[[25,5,25,10],[11,2,11,11],[13,2,13,10],[14,2,14,10],[12,2,12,10],[24,5,24,13]]}
[]
[]
[]
[]
[]
[]
[]
[]
[]
[]
{"$rows_left_out":41}
{"sheet":"Solar Resource","index":1,"n_rows":163,"n_cols":37,"rows_kept":163,"cut":false,"hidden":false,"merged":[[61,9,65,9],[45,0,48,0],[45,9,48,9],[30,0,33,0],[24,9,29,9],[40,0,44,0],[34,0,36,0],[34,9,36,9],[34,1,36,8],[24,0,29,0],[30,1,33,8],[24,1,29,8],[30,9,33,9],[116,11,118,13],[149,11,151,13],[38,1,39,8],[70,1,71,8],[102,1,103,8],[134,1,135,8],[115,1,120,8],[136,1,136,8],[104,1,104,8],[94,9,100,9],[72,1,73,8],[74,1,80,8],[81,1,87,8],[94,1,100,8],[83,11,85,13],[50,11,52,13],[40,9,44,9],[66,9,68,9],[40,1,44,8],[45,1,48,8],[49,1,54,8],[55,1,60,8],[61,1,65,8],[66,1,68,8],[110,0,114,0],[110,9,114,9],[115,0,120,0],[115,9,120,9],[110,1,114,8],[105,0,109,0],[105,9,109,9],[105,1,109,8],[49,0,54,0],[94,0,100,0],[88,1,93,8],[81,0,87,0],[81,9,87,9],[88,0,93,0],[88,9,93,9],[72,0,73,0],[72,9,73,9],[74,0,80,0],[74,9,80,9],[49,9,54,9],[66,0,68,0],[55,0,60,0],[55,9,60,9],[61,0,65,0],[144,0,147,0],[144,9,147,9],[140,1,143,8],[144,1,147,8],[137,0,139,0],[137,9,139,9],[137,1,139,8],[121,0,126,0],[121,9,126,9],[127,0,132,0],[127,9,132,9],[121,1,126,8],[127,1,132,8],[140,0,143,0],[140,9,143,9],[162,0,164,0],[162,9,164,9],[157,1,161,8],[162,1,164,8],[148,0,151,0],[148,9,151,9],[152,0,156,0],[152,9,156,9],[148,1,151,8],[152,1,156,8],[157,0,161,0],[157,9,161,9],[0,0,0,14],[1,0,1,7],[4,8,4,9],[19,9,23,9],[19,0,23,0],[12,9,18,9],[12,0,18,0],[8,9,11,9],[8,0,11,0],[17,11,19,13],[6,1,7,8],[19,1,23,8],[12,1,18,8],[8,1,11,8],[1,12,1,14],[2,12,2,14],[3,12,5,14],[2,0,3,7],[4,0,5,7],[2,8,2,9]]}
["Solar Resource: The average amount of sunlight in your area",null,null,null,null,null,null,null,null,null,null,null,null,null,null,null,null,null,null,null,null,null,null,null,null,null,null,null,"Invalid Latitude!!",null,null,null,null,null,"Latitude","Y/N","Order"]
["Step 1: Select your state (NM, AZ, CO, UT, NV) using the drop-down menu.",null,null,null,null,null,null,null,null,null,null,null,"Select your",null,null,null,null,null,null,null,null,null,null,null,null,null,null,null,null,null,null,null,null,null,31,{"$f":"IF(OR($M$4=\"New Mexico\",$M$4=\"Arizona\"),1.012,0.012)","v":1.012},{"$f":"INDEX($AI$2:$AI$13,MATCH(LARGE($AJ$2:$AJ$13,1),$AJ$2:$AJ$13,0))","v":31}]
["Next: Enter the \"Latitude\" of the location where you plan to install your solar lighting system using the state's reference map below and the drop-down menu. ",null,null,null,null,null,null,null,"Enter your Latitude",null,35,null,"State:",null,null,null,null,null,null,null,null,null,null,null,null,null,null,null,"New Mexico","Winter","Latitude",{"$f":"IF(#REF!=\"Summer\",4,3)","v":{"$error":"#REF!"}},null,null,32,{"$f":"IF(OR($M$4=\"New Mexico\",$M$4=\"Arizona\"),1.011,0.011)","v":1.0109999999999999},{"$f":"INDEX($AI$2:$AI$13,MATCH(LARGE($AJ$2:$AJ$13,2),$AJ$2:$AJ$13,0))","v":32}]
[null,null,null,null,null,null,null,null,null,null,null,null,"New Mexico",null,null,null,null,null,null,null,null,null,null,null,null,null,null,null,"Arizona","Summer","1-Axis Tracker",{"$f":"IF(#REF!=\"Summer\",6,5)","v":{"$error":"#REF!"}},null,null,33,{"$f":"IF(OR($M$4=\"New Mexico\",$M$4=\"Arizona\"),1.01,0.01)","v":1.01},{"$f":"INDEX($AI$2:$AI$13,MATCH(LARGE($AJ$2:$AJ$13,3),$AJ$2:$AJ$13,0))","v":33}]
["Step 2: Once Total Daily Insolation is calculated, move on to the next sheet titled Lights.",null,null,null,null,null,null,null,"Total Daily Insolation",null,{"$f":"IFERROR(IF(M4=\"New Mexico\",INDEX(AD26:AI31,MATCH(K3,AC26:AC31,0),AF8),IF(M4=\"Arizona\",INDEX(AD62:AI68,MATCH(K3,AC62:AC68,0),AF8),IF(M4=\"Colorado\",INDEX(AD91:AI95,MATCH(K3,AC91:AC95,0),AF8),IF(M4=\"Utah\",INDEX(AD126:AI131,MATCH(K3,AC126:AC131,0),AF8),IF(M4=\"Nevada\",INDEX(AD155:AI162,MATCH(K3,AC155:AC162,0),AF8)))))),0)","v":5},"kWh/day",null,null,null,null,null,null,null,null,null,null,null,null,null,null,null,null,"Colorado","All Year","+/- 15°",{"$f":"IF(#REF!=\"Summer\",2,1)","v":{"$error":"#REF!"}},null,null,34,{"$f":"IF(OR($M$4=\"New Mexico\",$M$4=\"Arizona\"),1.009,0.009)","v":1.0089999999999999},{"$f":"INDEX($AI$2:$AI$13,MATCH(LARGE($AJ$2:$AJ$13,4),$AJ$2:$AJ$13,0))","v":34}]
[null,null,null,null,null,null,null,null,null,null,null,null,null,null,null,null,null,null,null,null,null,null,null,null,null,null,null,null,"Utah",null,null,null,null,null,35,{"$f":"IF(OR($M$4=\"New Mexico\",$M$4=\"Arizona\",$M$4=\"Nevada\"),1.008,0.008)","v":1.008},{"$f":"INDEX($AI$2:$AI$13,MATCH(LARGE($AJ$2:$AJ$13,5),$AJ$2:$AJ$13,0))","v":35}]
[null,"NEW MEXICO",null,null,null,null,null,null,null,null,null,null,null,null,null,null,null,null,null,null,null,null,null,null,null,null,null,null,"Nevada",null,null,null,null,null,36,{"$f":"IF(OR($M$4=\"New Mexico\",$M$4=\"Arizona\",$M$4=\"Nevada\"),1.007,0.007)","v":1.0069999999999999},{"$f":"INDEX($AI$2:$AI$13,MATCH(LARGE($AJ$2:$AJ$13,6),$AJ$2:$AJ$13,0))","v":36}]
[null,null,null,null,null,null,null,null,null,null,null,null,null,null,null,null,null,null,null,null,null,null,null,null,null,null,null,null,null,{"$f":"IF(#REF!=\"Summer\",1,0)","v":{"$error":"#REF!"}},{"$f":"IF(#REF!=\"Latitude\",3,IF(#REF!=\"1-Axis Tracker\",5,3))","v":{"$error":"#REF!"}},3,null,null,37,{"$f":"IF(OR($M$4=\"Utah\",$M$4=\"Colorado\",$M$4=\"Nevada\"),1.006,0.006)","v":6.0000000000000001E-3},{"$f":"INDEX($AI$2:$AI$13,MATCH(LARGE($AJ$2:$AJ$13,7),$AJ$2:$AJ$13,0))","v":37}]
[36,36,null,null,null,null,null,null,null,36,null,null,null,null,null,null,null,null,null,null,null,null,null,null,null,null,null,null,null,null,null,null,null,null,38,{"$f":"IF(OR($M$4=\"Utah\",$M$4=\"Colorado\",$M$4=\"Nevada\"),1.005,0.005)","v":5.0000000000000001E-3},{"$f":"INDEX($AI$2:$AI$13,MATCH(LARGE($AJ$2:$AJ$13,8),$AJ$2:$AJ$13,0))","v":38}]
[null,null,null,null,null,null,null,null,null,null,null,null,null,null,null,null,null,null,null,null,null,null,null,null,null,null,null,null,null,null,null,null,null,null,39,{"$f":"IF(OR($M$4=\"Utah\",$M$4=\"Colorado\",$M$4=\"Nevada\"),1.004,0.004)","v":4.0000000000000001E-3},{"$f":"INDEX($AI$2:$AI$13,MATCH(LARGE($AJ$2:$AJ$13,9),$AJ$2:$AJ$13,0))","v":39}]
{"$rows_left_out":154}
{"sheet":"Lights","index":2,"n_rows":23,"n_cols":18,"rows_kept":23,"cut":false,"hidden":false,"merged":[[14,8,15,13],[11,8,11,10],[0,0,0,13],[13,8,13,11],[8,0,10,7],[13,0,14,7],[1,8,1,13],[11,0,12,7],[1,0,7,7],[15,0,15,7]]}
["Daily Energy Requirement of Lights"]
["Step 3: In the green cells to the right under the heading Quantity, enter the number of lights that you need to power. Next, enter the type of light (incandescent, LED, etc.) using the drop-down menu of those cells.  If you have any other type of light, you can enter the power required and the number of lights in the \"Other Lights\" cells. Finally, enter the number of hours per day you will be using each type of light in order to obtain the Daily Energy Requirement.",null,null,null,null,null,null,null,"Power Requirements",null,null,null,null,null,null,null,null,"Incandescent"]
[null,null,null,null,null,null,null,null,"Lights","Quantity","Type of Light","Total Power (W)","Hours/Day","Total (watt-hr/day)",null,null,null,"Halogen"]
[null,null,null,null,null,null,null,null,"40 Watt Light",1,"Halogen",{"$f":"IF(K4=\"Incandescent\",D18,IF(K4=\"Halogen\",E18,IF(K4=\"Fluorescent\",F18,IF(K4=\"LED\",G18,0))))","v":28},2,{"$f":"M4*L4*J4","v":56},null,null,null,"Fluorescent"]
[null,null,null,null,null,null,null,null,"50 Watt Light",1,"Fluorescent",{"$f":"IF(K5=\"Incandescent\",D19,IF(K5=\"Halogen\",E19,IF(K5=\"Fluorescent\",F19,IF(K5=\"LED\",G19,0))))","v":15},4,{"$f":"M5*L5*J5","v":60},null,null,null,"LED"]
[null,null,null,null,null,null,null,null,"60 Watt Light",0,"Incandescent",{"$f":"IF(K6=\"Incandescent\",D20,IF(K6=\"Halogen\",E20,IF(K6=\"Fluorescent\",F20,IF(K6=\"LED\",G20,0))))","v":60},0,0]
[null,null,null,null,null,null,null,null,"75 Watt Light",1,"LED",15,3,45]
[null,null,null,null,null,null,null,null,"100 Watt Light",0,"Incandescent",100,0,0]
["NOTE: The table below contains the typical power requirements of an incandescent light and the comparable power required by other types of lights. These values are used to determine the corresponding energy requirements depending on the type of light you will be using.",null,null,null,null,null,null,null,"150 Watt Light",0,"LED",{"$f":"IF(K9=\"Incandescent\",D23,IF(K9=\"Halogen\",E23,IF(K9=\"Fluorescent\",F23,IF(K9=\"LED\",G23,0))))","v":30},0,0]
[null,null,null,null,null,null,null,null,"Other Lights",0,"Misc ",0,0,{"$f":"M10*L10*J10","v":0}]
{"$rows_left_out":14}
{"sheet":"Battery Bank","index":3,"n_rows":34,"n_cols":31,"rows_kept":34,"cut":false,"hidden":false,"merged":[[8,11,8,13],[11,0,12,5],[21,0,22,5],[5,0,7,9],[8,0,9,9],[0,0,0,17],[2,11,3,17],[5,11,5,13],[6,11,6,13],[7,11,7,13],[1,0,4,9],[4,11,4,13]]}
["Battery Bank",null,null,null,null,null,null,null,null,null,null,null,null,null,null,null,null,null,null,null,null,null,null,null,null,null,"Temperatures"]
["Step 6: In the System Features table below, enter the values of system voltage (6, 12, 24, or 48), system de-rating factor (typically 5–20%), minimum temperature where the batteries are kept, and solar panel efficiency (typically about 85%). These are used to calculate the total W/day and A/day capacity required for the loads.",null,null,null,null,null,null,null,null,null,null,null,null,null,null,null,null,null,null,null,null,null,null,null,null,null,"F","C",null,null,6]
[null,null,null,null,null,null,null,null,null,null,null,"NOTE: Enter one-way distance between components. The units are in feet.",null,null,null,null,null,null,null,null,null,null,null,null,null,null,null,null,null,null,12]
[null,null,null,null,null,null,null,null,null,null,null,null,null,null,null,null,null,null,null,null,null,null,null,null,null,null,80,26.7,1,null,24]
[null,null,null,null,null,null,null,null,null,null,null,"Distance from:",null,null,null,null,null,null,null,null,null,null,null,null,null,null,70,21.2,1.04,null,48]
["Step 7: In the Battery Bank Size table, enter the  battery voltage and the rated battery Amp-hours.  Enter the number of days you want the lights to be able to run without recharging (used for cloudy days). Finally, enter your maximum depth of discharge (typically between 20–60%).",null,null,null,null,null,null,null,null,null,null,"Solar panels to controller",null,null,10,"ft",null,null,null,null,null,null,null,null,null,null,60,15.6,1.1100000000000001]
[null,null,null,null,null,null,null,null,null,null,null,"Batteries to controller",null,null,50,"ft",null,null,null,null,null,null,null,null,null,null,50,10,1.19]
[null,null,null,null,null,null,null,null,null,null,null,"Lights to controller",null,null,20,"ft",null,null,null,null,null,null,null,null,null,null,40,4.4000000000000004,1.3]
["Step 8: In the green cells to the right and using the diagram below as a guide, enter the distances between the components of the system. This is used to calculate the wire losses. ",null,null,null,null,null,null,null,null,null,null,"Total Distance",null,null,{"$f":"SUM(O6:O8)","v":80},"ft",null,null,null,null,null,null,null,null,null,null,30,-1.1000000000000001,1.4]
[null,null,null,null,null,null,null,null,null,null,null,null,null,null,null,null,null,null,null,null,null,null,null,null,null,null,20,-6.7,1.59]
{"$rows_left_out":25}
{"sheet":"Array Sizing","index":4,"n_rows":51,"n_cols":46,"rows_kept":51,"cut":false,"hidden":false,"merged":[[3,16,3,18],[2,0,6,5],[19,10,19,12],[7,0,8,8],[10,0,10,6],[11,0,11,3],[11,4,11,5],[9,0,9,10],[19,13,19,15],[35,2,35,4],[31,13,31,15],[31,10,31,11],[31,0,32,8],[12,21,12,36],[29,0,29,8],[20,13,20,15],[0,0,0,15],[21,6,21,7],[23,6,23,7],[25,6,25,7],[34,0,34,4]]}
["Sizing the PV Array"]
[null,null,null,null,null,null,null,null,null,null,null,null,null,null,null,null,null,null,null,null,null,null,null,null,null,null,null,null,null,null,null,null,null,null,null,null,null,null,"Wattage","Column",null,null,null,1]
["The purpose of this sheet is to calculate the size of the array needed for your system (see box to right). You should choose a PV module size (50–315W) from the sample list of ten below. The (most efficient) recommended choice is shown in the Recommended Option table at the bottom right.",null,null,null,null,null,null,null,null,null,null,null,null,null,null,null,null,null,null,null,null,null,null,null,null,null,null,null,null,null,null,null,null,null,null,null,null,"Smallest",{"$f":"SMALL($V$26:$AK$26,1)","v":4.2203999999999988},{"$f":"MATCH(SMALL($V$26:$AK$26,1),$V$26:$AK$26,0)","v":4},{"$f":"IFERROR(INDEX($V$12:$AK$12,AN3),0)","v":"4c1v"},null,{"$f":"IF(AO3>0,INDEX($V$27:$AK$27,AN3),0)","v":2},2]
[null,null,null,null,null,null,"Peak Panel Wattage",{"$f":"'Battery Bank'!E19*'Battery Bank'!E26/'Solar Resource'!K5","v":243.6},"W",null,null,null,null,null,null,null,"Pump Requirements",null,null,null,null,null,null,null,null,null,null,null,null,null,null,null,null,null,null,null,null,null,{"$f":"SMALL($V$26:$AK$26,2)","v":24.220199999999998},{"$f":"MATCH(SMALL($V$26:$AK$26,2),$V$26:$AK$26,0)","v":2},{"$f":"IFERROR(INDEX($V$12:$AK$12,AN4),0)","v":"2c1v"},null,{"$f":"IF(AO4>0,INDEX($V$27:$AK$27,AN4),0)","v":5},3]
[null,null,null,null,null,null,null,null,null,null,null,null,null,null,null,null,"Voltage",{"$f":"H6","v":12},{"$f":"R5","v":12},null,null,null,null,null,null,null,null,null,null,null,null,null,null,null,null,null,null,null,{"$f":"SMALL($V$26:$AK$26,3)","v":29.220299999999998},{"$f":"MATCH(SMALL($V$26:$AK$26,3),$V$26:$AK$26,0)","v":3},"3c1v",null,4,4]
[null,null,null,null,null,null,"Voltage",{"$f":"'Battery Bank'!E14","v":12},"V",null,null,null,null,null,null,null,"Current",{"$f":"H4/H6","v":20.3},{"$f":"R6/0.8","v":25.375},null,null,null,null,null,null,null,null,null,null,null,null,null,null,null,null,null,null,null,{"$f":"SMALL($V$26:$AK$26,4)","v":44.220599999999997},{"$f":"MATCH(SMALL($V$26:$AK$26,4),$V$26:$AK$26,0)","v":6},{"$f":"IFERROR(INDEX($V$12:$AK$12,AN6),0)","v":0},null,0,5]
[null,null,null,null,null,null,null,null,null,null,null,null,null,null,null,null,"Power",{"$f":"H4","v":243.6},{"$f":"R7/0.8","v":304.5},null,null,null,null,null,null,null,null,null,null,null,null,null,null,null,null,null,null,null,{"$f":"SMALL($V$26:$AK$26,5)","v":59.22},{"$f":"MATCH(SMALL($V$26:$AK$26,5),$V$26:$AK$26,0)","v":1},{"$f":"IFERROR(INDEX($V$12:$AK$12,AN7),0)","v":0},null,0,6]
["NOTE:  Modules in series (a string) give the required voltage, and the modules in parallel will achieve the power required by increasing the total amount of current.",null,null,null,null,null,null,null,null,null,null,null,null,null,null,null,"Real Power",{"$f":"H4","v":243.6},{"$f":"R8*1.05","v":255.78},null,null,null,null,null,null,null,null,null,null,null,null,null,null,null,null,null,null,null,{"$f":"SMALL($V$26:$AK$26,6)","v":69.220500000000001},{"$f":"MATCH(SMALL($V$26:$AK$26,6),$V$26:$AK$26,0)","v":5},{"$f":"IFERROR(INDEX($V$12:$AK$12,AN8),0)","v":"5c1v"},null,2,7]
[null,null,null,null,null,null,null,null,null,null,null,null,null,null,null,null,null,null,null,null,null,null,null,null,null,null,null,null,null,null,null,null,null,null,null,null,null,null,{"$f":"SMALL($V$26:$AK$26,7)","v":94.220699999999994},{"$f":"MATCH(SMALL($V$26:$AK$26,7),$V$26:$AK$26,0)","v":7},0,null,0,8]
["==============================================================================================",null,null,null,null,null,null,null,null,null,null,null,null,null,null,null,null,null,null,null,null,null,null,null,null,null,null,null,null,null,null,null,null,null,null,null,null,null,{"$f":"SMALL($V$26:$AK$26,8)","v":144.2208},{"$f":"MATCH(SMALL($V$26:$AK$26,8),$V$26:$AK$26,0)","v":8},0,null,0,9]
{"$rows_left_out":42}
{"sheet":" Design Spec","index":5,"n_rows":22,"n_cols":6,"rows_kept":22,"cut":false,"hidden":false,"merged":[[0,0,0,5],[17,1,17,3],[17,4,17,5],[20,1,20,3],[20,4,20,5],[11,0,16,0],[6,0,7,0],[6,3,7,3],[6,5,7,5],[1,0,1,5]]}
["Design Specification Summary  (estimated 2012 dollar amounts)"]
[]
["Item","Description",null,"Quantity","~","Price"]
["Charge Controller",{"$f":"'Battery Bank'!E14","v":12},"V",1,null,{"$f":"200*D4","v":200}]
["PV Solar Module(s) with j/box ","with a chosen wattage size of",{"$f":"'Array Sizing'!D25","v":65},{"$f":"'Array Sizing'!I18","v":4},null,{"$f":"2.5*C5*D5","v":650}]
["Fixed PV Rack System",null,null,1,null,{"$f":"IF(D5=1,250,IF(D5=2, 300,IF(D5=3,550,IF(D5=4,800,1000))))*D6","v":800}]
["Batteries",{"$f":"'Battery Bank'!E25","v":100},"A/H",{"$f":"'Battery Bank'!E32","v":3},null,{"$f":"B7*B8*D7*0.2","v":720}]
[null,{"$f":"'Battery Bank'!E24","v":12},"V"]
[{"$f":"IF('Array Sizing'!M31=\"Wire 12\",\"#12 UF wire\",IF('Array Sizing'!M31=\"Wire 10\",\"#10 UF wire\",IF('Array Sizing'!M31=\"Wire 8\",\"#8 UF wire\",IF('Array Sizing'!M31=\"Wire 6\",\"#6 UF wire\",IF('Array Sizing'!M31=\"Wire 4\",\"#4 UF wire\",IF('Array Sizing'!M31=\"Wire 2\",\"#2 UF wire\",IF('Array Sizing'!M31=\"Wire 0\",\"#0 UF wire\",IF('Array Sizing'!M31=\"Wire 00\",\"#00 UF wire\",\"Wire\"))))))))","v":"#4 UF wire"},"AWG sized wire for PV pump",null,{"$f":"'Array Sizing'!$D$48*1.25","v":115},"ft",{"$f":"IF(D9<250,200,400)","v":200}]
["Solid copper ground rod",null,null,8,"ft",25]
{"$rows_left_out":13}
{"sheet":"Conclusion","index":6,"n_rows":31,"n_cols":1,"rows_kept":31,"cut":false,"hidden":false,"merged":[[0,0,0,12],[28,7,28,8],[27,0,27,3],[27,7,27,8],[28,0,28,3]]}
["Simplified sketch of an example system (not your specs)"]
["Before exiting, print any sheets that you will need. Contact your county Extension agent if you have any questions (http://aces.nmsu.edu/county/)."]
[]
[]
[]
[]
[]
[]
[]
[]
{"$rows_left_out":21}