{"text_format":"1","workbook":"xlsx","n_sheets":8,"sheets":["Title Page","Solar Resource","Daily Water Requirement","Total Dynamic Head","Pump Selection","Array Sizing"," Design Spec","Conclusion"],"not_rendered":{"charts":7,"images":13,"macros":1,"external_links":0,"defined_names":5,"comments":6,"pivot_tables":0},"unopened":[],"bounds":{"document_bytes":16777216,"sheet_cells":100000,"rows_first":2000,"rows_last":500,"rows_between":2000,"halvings":0,"cell_chars":16384,"cell_head_chars":4096},"cells_cut":0,"cells_raw":0,"read":"whole","date_system":"1900"}

{"sheet":"Title Page","index":0,"n_rows":51,"n_cols":12,"rows_kept":51,"cut":false,"hidden":false,"merged":[[28,2,28,7],[11,2,11,11],[13,2,13,10],[14,2,14,10],[12,2,12,10],[26,2,26,12]]}
[]
[]
[]
[]
[]
[]
[]
[]
{"$rows_left_out":44}
{"sheet":"Solar Resource","index":1,"n_rows":238,"n_cols":37,"rows_kept":238,"cut":false,"hidden":false,"merged":[[17,11,19,13],[50,11,52,13],[83,11,85,13],[116,11,118,13],[149,11,151,13],[48,1,49,8],[81,1,82,8],[114,1,115,8],[147,1,148,8],[127,1,132,8],[105,1,111,8],[28,1,32,8],[33,1,38,8],[39,1,42,8],[43,1,45,8],[15,1,16,8],[170,0,174,0],[170,9,174,9],[153,0,156,0],[153,9,156,9],[157,0,160,0],[157,9,160,9],[153,1,156,8],[157,1,160,8],[133,0,138,0],[133,9,138,9],[139,0,144,0],[139,9,144,9],[133,1,138,8],[139,1,144,8],[122,0,126,0],[122,9,126,9],[127,0,132,0],[127,9,132,9],[122,1,126,8],[105,0,111,0],[105,9,111,9],[92,1,98,8],[99,1,104,8],[175,0,177,0],[175,9,177,9],[170,1,174,8],[175,1,177,8],[161,0,164,0],[161,9,164,9],[165,0,169,0],[165,9,169,9],[161,1,164,8],[165,1,169,8],[92,0,98,0],[92,9,98,9],[99,0,104,0],[99,9,104,9],[76,0,78,0],[76,9,78,9],[50,1,54,8],[55,1,58,8],[59,1,64,8],[65,1,70,8],[71,1,75,8],[76,1,78,8],[65,0,70,0],[65,9,70,9],[71,0,75,0],[71,9,75,9],[55,0,58,0],[55,9,58,9],[59,0,64,0],[59,9,64,9],[50,0,54,0],[50,9,54,9],[33,0,38,0],[33,9,38,9],[39,0,42,0],[39,9,42,9],[17,0,20,0],[17,9,20,9],[21,0,27,0],[21,9,27,9],[28,0,32,0],[28,9,32,9],[189,9,195,9],[189,0,195,0],[189,1,195,8],[180,1,181,8],[182,0,188,0],[182,1,188,8],[182,9,188,9],[0,0,0,14],[7,16,8,18],[2,0,7,7],[12,0,13,14],[10,0,10,14],[11,0,11,14],[1,0,1,7],[8,0,9,7],[8,8,8,9],[5,10,5,11],[7,12,8,14],[2,12,3,14],[4,12,5,14],[43,0,45,0],[43,9,45,9],[17,1,20,8],[21,1,27,8],[226,9,231,9],[232,0,236,0],[232,1,236,8],[232,9,236,9],[213,1,214,8],[215,9,220,9],[215,1,220,8],[215,0,220,0],[196,0,202,0],[237,0,240,0],[237,1,240,8],[237,9,240,9],[182,11,184,13],[215,11,217,13],[83,1,91,8],[83,0,91,0],[83,9,91,9],[149,9,152,9],[149,1,152,8],[149,0,152,0],[116,0,121,0],[116,1,121,8],[116,9,121,9],[203,9,210,9],[203,1,210,8],[203,0,210,0],[196,9,202,9],[196,1,202,8],[221,0,225,0],[221,1,225,8],[221,9,225,9],[226,0,231,0],[226,1,231,8]]}
["Solar Resource: The average amount of sun light in your area",null,null,null,null,null,null,null,null,null,null,null,null,null,null,null,null,null,null,null,null,null,null,null,null,null,null,null,"Invalid Latitude!!",null,null,null,null,null,"Latitude","Y/N","Order"]
["Step 1: Select your state (NM, AZ, CO, UT, NV, WY, MT) using the drop-down menu.",null,null,null,null,null,null,null,null,null,null,null,null,null,null,null,null,null,null,null,null,null,null,null,null,null,null,null,null,null,null,null,null,null,31,{"$f":"IF(OR($M$8=\"New Mexico\",$M$8=\"Arizona\"),1.018,0.018)","v":1.018},{"$f":"INDEX($AI$2:$AI$19,MATCH(LARGE($AJ$2:$AJ$19,1),$AJ$2:$AJ$19,0))","v":31}]
["Next: Enter the \"Latitude\" of the location where you plan to put your solar well using the state's reference map below and the drop-down menu. Click on the \"Time Period\" green cell to get a menu for the part of year you will be grazing - choose \"Summer\" for ONLY summer watering, \"Winter\" or \"All-Year\" - see *NOTE1 below. The next green cell \"Tracker or Tilt Angles\" allows you to choose the angle at which the solar panels will  be tilted - see *NOTE2.",null,null,null,null,null,null,null,"Latitude",null,34,null,"Select your",null,null,null,null,null,null,null,null,null,null,null,null,null,null,null,"New Mexico","Winter","Latitude",{"$f":"IF(K4=\"Summer\",4,3)","v":3},null,null,32,{"$f":"IF(OR($M$8=\"New Mexico\",$M$8=\"Arizona\"),1.017,0.017)","v":1.0169999999999999},{"$f":"INDEX($AI$2:$AI$19,MATCH(LARGE($AJ$2:$AJ$19,2),$AJ$2:$AJ$19,0))","v":32}]
[null,null,null,null,null,null,null,null,"Time Period*",null,"All Year",null,null,null,null,null,null,null,null,null,null,null,null,null,null,null,null,null,"Arizona","Summer","1-Axis Tracker",{"$f":"IF(K4=\"Summer\",6,5)","v":5},null,null,33,{"$f":"IF(OR($M$8=\"New Mexico\",$M$8=\"Arizona\"),1.016,0.016)","v":1.016},{"$f":"INDEX($AI$2:$AI$19,MATCH(LARGE($AJ$2:$AJ$19,3),$AJ$2:$AJ$19,0))","v":33}]
[null,null,null,null,null,null,null,null,null,null,null,null,"State:",null,null,null,null,null,null,null,null,null,null,null,null,null,null,null,"Colorado","All Year","+/- 15°",{"$f":"IF(K4=\"Summer\",2,1)","v":1},null,null,34,{"$f":"IF(OR($M$8=\"New Mexico\",$M$8=\"Arizona\"),1.015,0.015)","v":1.0149999999999999},{"$f":"INDEX($AI$2:$AI$19,MATCH(LARGE($AJ$2:$AJ$19,4),$AJ$2:$AJ$19,0))","v":34}]
[null,null,null,null,null,null,null,null,"Tracker or Tilt Angles",null,"+/- 15°",null,null,null,null,null,null,null,null,null,null,null,null,null,null,null,null,null,"Utah",null,null,null,null,null,35,{"$f":"IF(OR($M$8=\"New Mexico\",$M$8=\"Arizona\",$M$8=\"Nevada\"),1.014,0.014)","v":1.014},{"$f":"INDEX($AI$2:$AI$19,MATCH(LARGE($AJ$2:$AJ$19,5),$AJ$2:$AJ$19,0))","v":35}]
[null,null,null,null,null,null,null,null,null,null,null,null,null,null,null,null,null,null,null,null,null,null,null,null,null,null,null,null,"Nevada",null,null,null,null,null,36,{"$f":"IF(OR($M$8=\"New Mexico\",$M$8=\"Arizona\",$M$8=\"Nevada\"),1.013,0.013)","v":1.0129999999999999},{"$f":"INDEX($AI$2:$AI$19,MATCH(LARGE($AJ$2:$AJ$19,6),$AJ$2:$AJ$19,0))","v":36}]
[null,null,null,null,null,null,null,null,"Insolation at given latitude",null,{"$f":"IFERROR(IF(M8=\"New Mexico\",INDEX(AD26:AI31,MATCH(K3,AC26:AC31,0),AF8),IF(M8=\"Arizona\",INDEX(AD62:AI68,MATCH(K3,AC62:AC68,0),AF8),IF(M8=\"Colorado\",INDEX(AD91:AI95,MATCH(K3,AC91:AC95,0),AF8),IF(M8=\"Utah\",INDEX(AD126:AI131,MATCH(K3,AC126:AC131,0),AF8),IF(M8=\"Nevada\",INDEX(AD155:AI162,MATCH(K3,AC155:AC162,0),AF8),IF(M8=\"Wyoming\",INDEX(AE189:AJ192,MATCH(K3,AD189:AD192,0),AF8),IF(M8=\"Montana\",INDEX(AE221:AJ225,MATCH(K3,AD221:AD225,0),AF8)))))))),0)","v":5.53},"kWh/day","New Mexico",null,null,null,{"$f":"IF(INDEX(AJ2:AJ19,MATCH(K3,AI2:AI19,0))<1,AC1,\"\")","v":""},null,null,null,null,null,null,null,null,null,null,null,"Wyoming",{"$f":"IF(K4=\"Summer\",1,0)","v":0},{"$f":"IF(K6=\"Latitude\",3,IF(K6=\"1-Axis Tracker\",5,0))","v":0},{"$f":"IF(SUM(AD8:AE8)=0,1,IF(SUM(AD8:AE8)=1,2,SUM(AD8:AE8)))","v":1},null,null,37,{"$f":"IF(OR($M$8=\"Utah\",$M$8=\"Colorado\",$M$8=\"Nevada\"),1.012,0.012)","v":1.2E-2},{"$f":"INDEX($AI$2:$AI$19,MATCH(LARGE($AJ$2:$AJ$19,7),$AJ$2:$AJ$19,0))","v":37}]
{"$rows_left_out":231}
{"sheet":"Daily Water Requirement","index":2,"n_rows":37,"n_cols":15,"rows_kept":37,"cut":false,"hidden":false,"merged":[[35,9,36,14],[13,0,14,8],[0,0,0,9],[30,9,30,12],[27,9,27,12],[1,0,4,8],[5,0,7,8],[8,0,10,8],[11,0,12,8],[15,0,15,6],[15,7,15,8],[1,9,1,14],[24,9,24,10],[28,9,28,10],[32,9,33,14]]}
["Daily Water Requirement and Storage for",null,null,null,null,null,null,null,null,null,{"$f":"H17","v":"All Year"},"Watering"]
["Step 3: Enter the number of each animal that needs water in the green cells to the right under the heading Quantity. If you have any other daily water requirements, you can enter that value in the Other Water Requirements cell. You can change the animal water requirement values in the green cells below. Use the values in the grey cells below as a guide.",null,null,null,null,null,null,null,null,"Water Requirements"]
[null,null,null,null,null,null,null,null,null,"Animal",null,null,"Quantity","Gallons/Day"]
[null,null,null,null,null,null,null,null,null,"Nursing Cows",null,null,0,{"$f":"$M$4*E18","v":0}]
[null,null,null,null,null,null,null,null,null,"Bred Dry Cows & Heifers",null,null,0,{"$f":"$M$5*E19","v":0}]
["NOTE: The orange colored cells calculate the daily water requirements for the number of each animal entered (gallons per day). The highlighted cells in yellow at the bottom gives your Total Daily Water Requirement.  ",null,null,null,null,null,null,null,null,"Bulls",null,null,5,{"$f":"$M$6*E20","v":100}]
[null,null,null,null,null,null,null,null,null,"Growing Cattle"]
[null,null,null,null,null,null,null,null,null,null,"400 lbs",null,4,{"$f":"$M$8*E22","v":40}]
{"$rows_left_out":30}
{"sheet":"Total Dynamic Head","index":3,"n_rows":41,"n_cols":19,"rows_kept":41,"cut":false,"hidden":false,"merged":[[34,0,34,10],[33,0,33,2],[0,0,0,13],[27,0,29,7],[33,8,33,10],[2,0,5,7],[30,8,30,10],[30,0,32,7],[9,11,10,15],[11,12,14,15]]}
["Total Dynamic Head (TDH)"]
[null,null,null,null,null,null,null,null,null,null,null,"Choices for ","Max.","Pipe "]
["Step 6: Using the \"example\" diagram  below, enter your values for well water level and the discharge elevation of your storage tank as well as other information in the green cells to the right. Note the corresponding color coding of diagram parts and their associated table entries to the right.",null,null,null,null,null,null,null,"Water Level",50,"ft","Pipe Sizes (in.)","gpm","Choice"]
[null,null,null,null,null,null,null,null,"Pump Level ",55,"ft",0.5,7,"PVC",null,null,null,{"$f":"IF(OR(L14=\"0.5 in\"),1.006,0.006)","v":6.0000000000000001E-3},{"$f":"INDEX(L4:L9,MATCH(LARGE(R4:R9,1),R4:R9,0))","v":1}]
[null,null,null,null,null,null,null,null,"Discharge Elevation",15,"ft",0.75,11,"Poly",null,null,null,{"$f":"IF(OR(L14=\"0.5 in\",L14=\"0.75 in\"),1.005,0.005)","v":5.0000000000000001E-3},{"$f":"INDEX(L4:L9,MATCH(LARGE(R4:R9,2),R4:R9,0))","v":1.5}]
[null,null,null,null,null,null,null,null,"Distance from well to storage tank",80,"ft",1,16,"Metal ",null,null,null,{"$f":"IF(OR(L14=\"0.5 in\",L14=\"0.75 in\",L14=\"1 in\"),1.004,0.004)","v":1.004},{"$f":"INDEX(L4:L9,MATCH(LARGE(R4:R9,3),R4:R9,0))","v":2}]
[null,null,null,null,null,null,null,null,null,null,null,1.5,35,null,null,null,null,{"$f":"IF(OR(L14=\"0.5 in\",L14=\"0.75 in\",L14=\"1 in\",L14=\"1.5 in\"),1.003,0.003)","v":1.0029999999999999},{"$f":"INDEX(L4:L9,MATCH(LARGE(R4:R9,4),R4:R9,0))","v":3}]
[null,null,null,null,null,null,null,null,"Total Vertical Lift (Static Head)",{"$f":"SUM(J4,J5)","v":70},"ft",2,55,null,null,null,null,{"$f":"IF(OR(L14=\"0.5 in\",L14=\"0.75 in\",L14=\"1 in\",L14=\"1.5 in\",L14=\"2 in\"),1.002,0.002)","v":1.002},{"$f":"INDEX(L4:L9,MATCH(LARGE(R4:R9,5),R4:R9,0))","v":0.5}]
{"$rows_left_out":34}
{"sheet":"Pump Selection","index":4,"n_rows":186,"n_cols":108,"rows_kept":186,"cut":false,"hidden":false,"merged":[[32,0,32,14],[29,0,29,14],[30,0,30,14],[29,20,29,25],[15,0,15,3],[16,15,16,18],[15,15,15,18],[16,0,16,3],[31,0,31,14],[17,15,17,18],[27,19,27,26],[27,0,27,14],[28,0,28,14],[20,8,20,13],[18,8,18,13],[22,8,22,13],[18,0,18,3],[0,32,0,55],[9,15,9,20],[1,0,6,13],[1,15,1,18],[3,15,3,18],[2,15,2,19],[0,0,0,19],[0,20,0,30],[4,96,5,96],[6,96,12,96],[11,0,12,13],[14,8,14,13],[6,21,8,26],[7,0,9,13],[7,15,7,18],[6,15,6,18],[14,0,14,3]]}
["Pump Selection",null,null,null,null,null,null,null,null,null,null,null,null,null,null,null,null,null,null,null,"       Go back to start!",null,null,null,null,null,null,null,null,null,null,null,"Go back to start!"]
["Step 8: In this step you will select a solar pump for the calculated Q and TDH values shown in the yellow cells to the right.  Every pump has certain limits of Q and TDH which are defined by the manufacturer - often in what's called a pump curve. You must select a pump that falls within these limits, try to maximize its efficiency, and determine its operating voltage and the PV power needed to run it. Using an example manufacturer (SUN PUMPS) and a small set of 1HP (or less) pumps,  the system will recommend the best pump (from the example pumps curve data). The user may use this same technique to select another pump, different type or manufacturer - see user manual for more discussion.",null,null,null,null,null,null,null,null,null,null,null,null,null,null,"Flow Rate (Q)",null,null,null,{"$f":"ROUNDUP('Daily Water Requirement'!$N$28/('Solar Resource'!$K$9*60),1)","v":8.2999999999999989},"gpm"]
[null,null,null,null,null,null,null,null,null,null,null,null,null,null,null,null,null,null,null,null,null,null,null,null,null,null,null,null,null,null,null,null,null,null,null,null,null,null,null,null,null,null,null,null,null,null,null,null,null,null,null,null,null,null,null,null,null,null,null,null,null,null,null,null,null,null,null,null,null,null,null,null,null,null,null,null,null,null,null,null,null,null,null,null,null,null,null,null,null,null,null,null,null,null,null,null,null,null,null,null,null,null,null,null,null,"Sorted"]
[null,null,null,null,null,null,null,null,null,null,null,null,null,null,null,"Total Dynamic Head (TDH)",null,null,null,{"$f":"'Total Dynamic Head'!$L$34","v":115},"ft",null,null,null,null,null,null,null,null,null,null,null,null,null,null,null,null,null,null,null,null,null,null,null,null,null,null,null,null,null,null,null,null,null,null,null,null,null,null,null,null,null,null,null,null,null,null,null,null,null,null,null,null,null,null,null,null,null,null,null,null,null,null,null,null,null,null,null,null,null,null,null,null,null,null,null,null,null,"Pump","W","V","I",null,"SDS-T-128",{"$f":"IF(AND($CI$10=0,CI9=0),0.00013,1.00013)","v":1.2999999999999999E-4},{"$f":"INDEX(CZ4:CZ18,MATCH(LARGE($DA$4:$DA$18,1),$DA$4:$DA$18,0))","v":"SCS-18-160"},null,{"$f":"IF(INDEX(DA4:DA18,MATCH(T16,CZ4:CZ18,0))=0,A184,\"\")","v":""}]
[null,null,null,null,null,null,null,null,null,null,null,null,null,null,null,null,null,null,null,{"$f":"T4*0.3048","v":35.052},"m",null,null,null,null,null,null,null,null,null,null,null,null,null,null,null,null,null,null,null,null,null,null,null,null,null,null,null,null,null,null,null,null,null,null,null,null,null,null,null,null,null,null,null,null,null,null,null,null,null,null,null,null,null,null,null,null,null,null,null,null,null,null,null,null,null,null,null,null,null,null,null,null,null,null,null,null,null,null,null,null,null,null,"SCS-8-90",{"$f":"IF(AND($CI$34=0,$CI$46=0),0.00009,1.00009)","v":9.0000000000000006E-5},{"$f":"INDEX(CZ4:CZ18,MATCH(LARGE($DA$4:$DA$18,2),$DA$4:$DA$18,0))","v":"SCS-10-230"}]
[null,null,null,null,null,null,null,null,null,null,null,null,null,null,null,null,null,null,null,null,null,null,null,null,null,null,null,null,null,null,null,null,null,null,null,null,null,null,null,null,null,null,null,null,null,null,null,null,null,null,null,null,null,null,null,null,null,null,null,null,null,null,null,null,null,null,null,null,null,null,null,null,null,null,null,null,null,null,null,null,null,null,null,null,null,null,null,null,null,null,null,null,null,null,null,null,null,null,null,null,null,null,null,"SCS-6-185",{"$f":"IF(AND($CI$58=0,$CI$70=0,$CI$82=0,$CI$94=0,$CI$105=0),0.00006,1.00006)","v":6.0000000000000002E-5},{"$f":"INDEX(CZ4:CZ18,MATCH(LARGE($DA$4:$DA$18,3),$DA$4:$DA$18,0))","v":"SCS-30-115"},"SDS-T-128"]
[null,null,null,null,null,null,null,null,null,null,null,null,null,null,null,"Preferred SCS Pump Choice",null,null,null,{"$f":"U31","v":"18-160"},null,{"$f":"IF(AND(CI108=0,CI107=0,CI106=0,CI105=0,CI104=0,CI99=0,CI98=0,CI97=0,CI96=0,CI95=0,CI94=0,CI93=0,CI92=0),A182,\"\")","v":""},null,null,null,null,null,null,null,null,null,null,null,null,null,null,null,null,null,null,null,null,null,null,null,null,null,null,null,null,null,null,null,null,null,null,null,null,null,null,null,null,null,null,null,null,null,null,null,null,null,null,null,null,null,null,null,null,null,null,null,null,null,null,null,null,null,null,null,null,null,null,null,null,null,null,"SCS","At 30 V",{"$f":"CQ38","v":"None"},{"$f":"IF(CU7<>\"None\",(SMALL(CK30:CK37,COUNTIF(CK30:CK37,0)+1)),0)","v":0},{"$f":"IF(CU7<>\"None\",30,0)","v":0},{"$f":"IF(CU7<>\"None\",CV7/CW7,0)","v":0},null,"SCS-4-325",{"$f":"IF(AND($CI$57=0,$CI$69=0,$CI$81=0,$CI$93=0,$CI$104=0),0.00007,1.00007)","v":6.9999999999999994E-5},{"$f":"INDEX(CZ4:CZ18,MATCH(LARGE($DA$4:$DA$18,4),$DA$4:$DA$18,0))","v":"SDS-Q-128"}]
["NOTE: Other pumps (and manufacturers) are available which may meet your pumping requirements. However, the process for determining flow-rate (Q) and TDH is the same while a different pump curve would be used to select a pump, PV wattage, and operating voltage. See user manual for more discussion.",null,null,null,null,null,null,null,null,null,null,null,null,null,null,"and its Motor Voltage",null,null,null,{"$f":"IF(U31=\"None\",0,Y31)","v":90},"V",null,null,null,null,null,null,null,null,null,null,null,null,null,null,null,null,null,null,null,null,null,null,null,null,null,null,null,null,null,null,null,null,null,null,null,null,null,null,null,null,null,null,null,null,null,null,null,null,null,null,null,null,null,null,null,null,null,null,null,null,null,null,null,null,null,null,null,null,null,null,null,null,null,null,null,null,"At 45 V",{"$f":"CQ51","v":"None"},{"$f":"IF(CU8<>\"None\",SMALL(CK42:CK50,COUNTIF(CK42:CK50,0)+1),0)","v":0},{"$f":"IF(CU8<>\"None\",45,0)","v":0},0,null,"SCS-3-425",{"$f":"IF(AND($CI$68=0,$CI$92=0,$CI$80=0),0.00002,1.00002)","v":2.0000000000000002E-5},{"$f":"INDEX(CZ4:CZ18,MATCH(LARGE($DA$4:$DA$18,5),$DA$4:$DA$18,0))","v":"SDS-Q-135"}]
{"$rows_left_out":179}
{"sheet":"Array Sizing","index":5,"n_rows":49,"n_cols":46,"rows_kept":49,"cut":false,"hidden":false,"merged":[[0,0,0,15],[20,13,20,15],[31,13,31,15],[31,10,31,11],[12,21,12,36],[28,0,28,8],[3,16,3,18],[2,0,6,5],[19,10,19,12],[7,0,8,8],[10,0,10,6],[11,0,11,3],[11,4,11,5],[9,0,9,10],[30,0,31,8],[19,13,19,15]]}
["Sizing the PV Array"]
[null,null,null,null,null,null,null,null,null,null,null,null,null,null,null,null,null,null,null,null,null,null,null,null,null,null,null,null,null,null,null,null,null,null,null,null,null,null,"Wattage","Column",null,null,null,1]
["The purpose of this sheet is to calculate the size of the array needed for your pump requirements (see box to right). You should choose a PV module size (50-315W) from the sample list of ten below. The (most efficient) recommended  choice is shown at the right bottom of the sheet.",null,null,null,null,null,null,null,null,null,null,null,null,null,null,null,null,null,null,null,null,null,null,null,null,null,null,null,null,null,null,null,null,null,null,null,null,"Smallest",{"$f":"SMALL($V$26:$AK$26,1)","v":4.0011000000000001},{"$f":"MATCH(SMALL($V$26:$AK$26,1),$V$26:$AK$26,0)","v":11},{"$f":"IFERROR(INDEX($V$12:$AK$12,AN3),0)","v":0},null,{"$f":"IF(AO3>0,INDEX($V$27:$AK$27,AN3),0)","v":0},2]
[null,null,null,null,null,null,"Peak Panel Wattage",{"$f":"'Pump Selection'!T18","v":520},"W",null,null,null,null,null,null,null,"Pump Requirements",null,null,null,null,null,null,null,null,null,null,null,null,null,null,null,null,null,null,null,null,null,{"$f":"SMALL($V$26:$AK$26,2)","v":9.0002999999999993},{"$f":"MATCH(SMALL($V$26:$AK$26,2),$V$26:$AK$26,0)","v":3},{"$f":"IFERROR(INDEX($V$12:$AK$12,AN4),0)","v":0},null,{"$f":"IF(AO4>0,INDEX($V$27:$AK$27,AN4),0)","v":0},3]
[null,null,null,null,null,null,null,null,null,null,null,null,null,null,null,null,"Voltage",{"$f":"H6","v":75},{"$f":"R5","v":75},null,null,null,null,null,null,null,null,null,null,null,null,null,null,null,null,null,null,null,{"$f":"SMALL($V$26:$AK$26,3)","v":14.000400000000001},{"$f":"MATCH(SMALL($V$26:$AK$26,3),$V$26:$AK$26,0)","v":4},"4v1c",null,5,4]
[null,null,null,null,null,null,"Motor Voltage",{"$f":"'Pump Selection'!T17","v":75},"V",null,null,null,null,null,null,null,"Current",{"$f":"H4/H6","v":6.9333333333333336},{"$f":"R6/0.8","v":8.6666666666666661},null,null,null,null,null,null,null,null,null,null,null,null,null,null,null,null,null,null,null,{"$f":"SMALL($V$26:$AK$26,4)","v":14.0007},{"$f":"MATCH(SMALL($V$26:$AK$26,4),$V$26:$AK$26,0)","v":7},{"$f":"IFERROR(INDEX($V$12:$AK$12,AN6),0)","v":0},null,0,5]
[null,null,null,null,null,null,null,null,null,null,null,null,null,null,null,null,"Power",{"$f":"H4","v":520},{"$f":"R7/0.8","v":650},null,null,null,null,null,null,null,null,null,null,null,null,null,null,null,null,null,null,null,{"$f":"SMALL($V$26:$AK$26,5)","v":24.000599999999999},{"$f":"MATCH(SMALL($V$26:$AK$26,5),$V$26:$AK$26,0)","v":6},{"$f":"IFERROR(INDEX($V$12:$AK$12,AN7),0)","v":0},null,0,6]
["NOTE:  Modules in series (a string) give the required voltage, and the modules in parallel will achieve the power required by increasing the total amount of current.",null,null,null,null,null,null,null,null,null,null,null,null,null,null,null,"Real Power",{"$f":"H4","v":520},{"$f":"R8*1.05","v":546},null,null,null,null,null,null,null,null,null,null,null,null,null,null,null,null,null,null,null,{"$f":"SMALL($V$26:$AK$26,6)","v":39.000900000000001},{"$f":"MATCH(SMALL($V$26:$AK$26,6),$V$26:$AK$26,0)","v":9},0,null,0,7]
{"$rows_left_out":42}
{"sheet":" Design Spec","index":6,"n_rows":37,"n_cols":6,"rows_kept":37,"cut":false,"hidden":false,"merged":[[0,0,0,5],[25,1,25,3],[25,4,25,5],[28,1,28,3],[28,4,28,5],[13,0,24,0]]}
["Design Specification Summary  ( est. 2012 dollar amounts)*"]
[]
["Item","Description",null,"Quantity","~","Price"]
["Submersible solar water pump by Sun Pumps",{"$f":"'Pump Selection'!T16","v":"SCS-10-230"},null,1,null,{"$f":"IF(B4=\"SDS-Q-128\",820,IF(B4=\"SDS-Q-135\",820,IF(B4=\"SDS-T-135\",530,IF(B4=\"SCS-18-45\",1950,IF(B4=\"SCS-12-95\",1700,IF(B4=\"SCS-3-200\",2000,IF(B4=\"SCS-8-90\",1600,IF(B4=\"SCS-18-160\",1900,IF(B4=\"SCS-4-325\",2100,IF(B4=\"SCS-6-185\",1750,IF(B4=\"SCS-10-230\",2100,IF(B4=\"SCS-11-120\",1980,IF(B4=\"SCS-14-160\",2050,IF(B4=\"SCS-30-115\",2075,IF(B4=\"SCS-3-425\",2200,0)))))))))))))))","v":2100}]
["PV Solar Module(s) with j/box ","with a chosen Wattage Size of",{"$f":"'Array Sizing'!D25","v":140},{"$f":"'Array Sizing'!I18","v":4},null,{"$f":"2.5*C5*D5","v":1400}]
["Fixed PV Rack System",null,null,{"$f":"IF(D7=1,0,1)","v":1},null,{"$f":"IF(D5=1,250,IF(D5=2, 300,IF(D5=3,550,IF(D5=4,800,1000))))*D6","v":800}]
["Tracker system","1-Axis Tracker System",null,{"$f":"IF('Solar Resource'!$K$6=\"1-Axis Tracker\",1,0)","v":0},null,{"$f":"('Array Sizing'!$D$27*'Array Sizing'!$D$26*'Array Sizing'!$I$18)*2.3*D7","v":0}]
["DC Solar Pump Controller & float level controller","The specific size and type is dependent on Pump Voltage and should be sized accordingly",{"$f":"IF('Pump Selection'!T17<31,\"15-30V\",IF('Pump Selection'!T17<61,\"30-60V\",IF('Pump Selection'!T17<71,\"30-60V\",IF('Pump Selection'!T17<91,\"60-90V\",IF('Pump Selection'!T17<121,\"90-120V\",\"?\")))))","v":"60-90V"},1,null,400]
{"$rows_left_out":30}
{"sheet":"Conclusion","index":7,"n_rows":29,"n_cols":16,"rows_kept":29,"cut":false,"hidden":false,"merged":[[0,0,0,12],[28,7,28,8],[27,0,27,3],[27,7,27,8],[17,15,22,17]]}
[" Simplified sketch of an example system (not your specs)"]
["Before exiting, print any sheets that you will need. Contact your extension agent if you have any questions."]
[]
[]
[]
[]
[]
[]
{"$rows_left_out":21}